{"text_format":"2","workbook":"xlsx","n_sheets":6,"sheets":["Explanation uniform dataset","Validatie","Data for Attributes per Brick","Bricks","Bricks added in version","Foutmeldingen"],"not_rendered":{"charts":0,"images":1,"macros":0,"external_links":0,"defined_names":3,"comments":1,"pivot_tables":0},"unopened":[],"bounds":{"document_bytes":16777216,"sheet_cells":100000,"run_cost":"one","rows_first":2000,"rows_last":500,"rows_between":2000,"halvings":0,"cell_chars":16384,"cell_head_chars":4096},"cells_cut":0,"cells_raw":0,"read":"whole","date_system":"1900"}

{"sheet":"Explanation uniform dataset","index":0,"n_rows":8,"n_cols":44,"rows_kept":8,"cut":false,"hidden":false,"merged":[[7,13,7,18],[0,0,0,10]]}
["Uniforme Dataset - Toelichting    /    Uniform Dataset - Explanation"]
["#",1,2,3,4,5,6,7,8,9,10,11,12,13,14,15,16,17,18,19,20,21,22,23,"23a",24,25,26,27,28,29,"29a",null,30,null,31,32,"32a",33,34,35,36,"36a",37]
["Questions \n(Dutch/Nederlands)","Leveranciers artikelnummer","Naam leverancier","GLN leverancier\nGlobal Location Number","Artikel omschrijving","Referentienummer fabrikant","Naam fabrikant","Beoogd gebruik product: geef GMDN code ","CE markering\nja/ nee","Conform welke wetgeving\ndrop down menu","Expiratiedatum CE certificaat \nyyyy-mm-dd/ NA","Risico klasse\ndrop down menu","Aangewezen instantie nummer\n0000","Hoeveelheid kleinste eenheid\nBijvoorbeeld stuks ","Stuks identificatie \nGTIN","Aantal per binnenverpakking","Binnenverpakking identificatie \nGTIN","Aantal per bestelverpakking ","Bestelverpakking identificatie \nGTIN","Is het product steriel?\nja/ nee","Welke opslag condities zijn noodzakelijk? \nzie drop down menu","Bevat het artikel latex?\nja/ nee","Artikel bevat weekmakers? \nja/ nee","Zijn er specifieke eisen voor afvalverwerking van het product? / \nja/ nee\nIndien ja: gelieve te specificeren in de volgende vraag.","Specifieke eisen voor afvalverwerking van het product ","Voeg het CE certificaat toe, bij voorkeur als PDF / \nGeef de naam van het bijgevoegde CE certificaat (xxx.pdf) of geef de URL van het CE certificaat","Voeg de conformiteitsverklaring toe, bij voorkeur als PDF/ \nGeef de naam van het bijgevoegde DoC (xxx.pdf) of geef de URL van het DoC ","Voeg een afbeelding van het product toe\nNaam afbeelding of URL naar de afbeelding van het product ","Voeg de handleiding toe \nGeef de naam van de bijgevoegde handleiding (xxx.pdf) of geef de URL van de handleiding ","Is het product bestemd voor eenmalig gebruik of herbruikbaar?\ndrop down menu","Is scholing voor veilig gebruik van het product noodzakelijk? \nja/ nee\nIndien ja, graag specificeren met bijlage bij vraag 29a","Geef de naam van het bijgevoegde scholingsdocument (xxx.pdf) of geef de URL van het scholingsdocument","Voor eenmalig gebruik én welke niet gesteriliseerd hoeven te worden? De volgende vragen hoeven niet ingevuld te worden.","Is sterilisatie of machinale desinfectie van het product mogelijk?\nja/ nee","Sterilisatie of machinale desinfectie niet mogelijk? De volgende vragen hoeven niet ingevuld te worden. ","Is scholing voor het reinigen, desinfecteren en/of steriliseren van het product noodzakelijk? \nja/ nee\nIndien ja, graag specificeren met bijlage","Welke vorm van handmatige voorreiniging op de CSA is noodzakelijk? \nzie drop down menu","Indien anders, specificeer","Welke vorm van machinale reiniging (ISO 15883) is mogelijk met gebruikmaking van een detergent met een pH ≥ 10? \nzie drop down menu","Welke vorm van machinale desinfectie (ISO 15883) is mogelijk? \nzie drop down menu","Is het product bestand tegen een oppervlakte-spanningsverlagend middel?\nja/ nee","Welke vorm van sterilisatie is mogelijk? \nzie drop down menu","Indien waterstof peroxide: specificeer merk en type apparaat en programma, indien anders, specificeer methode. ","Reinigings-, desinfectie- en sterilisatievoorschrift conform EN-ISO 17664 en setbeschrijving moeten meegestuurd worden. Zijn deze toegevoegd?\nja/ nee"]
["Questions \n(English/Engels)"," Supplier article number","Supplier name","GLN supplier\nGlobal Location Number","Article description","Reference number (REF)","Name manufacturer","Intended Use Article: give GMDN code\n","CE-mark\nyes/ no","Conform regulations\ndrop down list","Expiry date CE certificate \nyyyy-mm-dd/ NA","Risk class\ndrop down list","Notified Body number\n0000","Unit of Measure smallest unit\nFor example piece","Piece identifier \nGTIN","Amount inner carton","Inner carton identifier \nGTIN","Amount outer carton","Outer carton identifier \nGTIN","Is the item sterile?\nyes/ no","Wich storage conditions are required? \nsee drop down list","Article contains latex?\nyes/ no","Article contains softeners like phthalates?\nyes/ no","Are there specific requirements regarding waste processing of the product? \nyes/ no \nIf yes: please specify in next question.","Specific requirements regarding waste processing of the product","Please supply the CE certificate, preferrably in PDF format.\nGive name of the attached CE certificate (xxx.pdf) or give the link of the CE certificate","Please supply the Declaration of conformity (DoC), preferrably in PDF format.\nGive name of the attached DoC (xxx.pdf) or give the link of the DoC","Please supply a picture of the product \nPicture name or URL to the picture of the product","Please supply the instruction manual\nGive name of the attached instruction manual (xxx.pdf) or give the link of the instruction manual","Is the product single use or reusable?\ndrop down list","Is education for safe use of the product necessary? \nyes/ no\nIn case yes, please specify with attachment in question 29a","Give name of the attached training document (xxx.pdf) or give the link of the training document","Single use and not to be sterilized? The next questions do not have to be filled.","Is sterilisation or automated disinfection of the product possible?\nyes/ no","Sterilisation or automated disinfection not possible? The next questions do not have to be filled.","Is education for reprocessing of the product necessary? \nyes/ no\nIn case yes, please specify with attachment","Which form of manual pre-cleaning in the CSSD is necesary?\nsee drop down list","In case other, please specify","What form of automated cleaning (ISO 15883) is possible using a detergent with a pH ≥ 10?\nsee drop down list","\nWhat form of automated disinfection (ISO 15883) is possible?\nSee drop down list","Is the product resistant to a surface tension reducing agent?\nyes/ no","Which form of sterilization is possible?\nsee drop down list","In case of hydrogen peroxide: specify make and type of device and program. In case different, specify method.","Cleaning, disinfection and sterilization instructions in accordance with EN-ISO 17664 and set description must be enclosed. Have these been added?\nyes/ no"]
[]
["Required","Mandatory","Mandatory","Mandatory","Mandatory","Mandatory","Mandatory","Mandatory","Mandatory","Mandatory","Conditionally mandatory","Mandatory","Conditionally mandatory","Mandatory","Mandatory","Mandatory","Mandatory","Mandatory","Mandatory","Conditionally mandatory","Mandatory","Mandatory","Mandatory","Mandatory","Conditionally mandatory","Conditionally mandatory","Mandatory","Mandatory","Conditionally mandatory","Mandatory","Conditionally mandatory","Conditionally mandatory",null,"Conditionally mandatory",null,"Conditionally mandatory","Conditionally mandatory","Conditionally mandatory","Conditionally mandatory","Conditionally mandatory","Conditionally mandatory","Conditionally mandatory","Conditionally mandatory","Conditionally mandatory"]
[]
["The following GDSN attributes should be used","GDSN\nCombination of the following attributes: 'Additional Trade Item Identification' and 'Additional Trade Item Identification Type Code' with code SUPPLIER_ASSIGNED or alternatively MODEL_NUMBER.\n\nSUPPLIER_ASSIGNED\nThe additional Trade Item Identification value populated has been developed and assigned by the party which provides service(s) and/or manufactures or otherwise has possession of the goods and consigns or makes them available in trade. This number is a base model or style number assigned to the product and may be the same for several GTINs where they are variations of each other. \n\nMODEL_NUMBER\nThe additional Trade Item Identification value populated is an identification number which defines the configuration of the product in addition to the Item number. This is typically printed or otherwise attached to an item.","GDSN\nInformation Provider Name","GDSN\nInformation Provider GLN","GDSN\nTrade Item Description","GDSN\nCombination of the following attributes: 'Additional Trade Item Identification' and 'Additional Trade Item Identification Type Code' with code MANUFACTURER_PART_NUMBER or alternatively MODEL_NUMBER.\n\nMANUFACTURER_PART_NUMBER\nThe additional Trade Item Identification value populated is an identifier of a part used for an item. While the name implies that the number is assigned by the manufacturer, the part may be built by one manufacturer to apply to another manufacturer’s item. In this case this number is the applicable part number from the item’s manufacturer.\n\nMODEL_NUMBER\nThe additional Trade Item Identification value populated is an identification number which defines the configuration of the product in addition to the Item number. This is typically printed or otherwise attached to an item.","GDSN\nManufacturer name (partyName)","GDSN\nCombination of the following attributes: 'Additional Trade Item Classification System Code'  with code 35 (Global Medical Devices Nomenclature) and 'Additional Trade Item Classification Code Value' with the applicable GMDN code.","GDSN\nRegulation Type Code\n\nIf the item does have a CE-mark, the code CE should be used.","GDSN\nEntered via the Risk class (column L)","GDSN\nCertification Effective End Date Time","GDSN\nCombination of the following attributes: 'Additional Trade Item Classification System Code'  with code '76 (EU DeviceRiskClass MDR/IVDR)' or '85 (EU Directive MDD/AIMDD/IVDD Risk Class)' and 'Additional Trade Item Classification Code Value' with the applicable risk class, one of the following values for code 76:\n'EU_CLASS_I', 'EU_CLASS_IIA', 'EU_CLASS_IIB', 'EU_CLASS_III', 'EU_CLASS_A', 'EU_CLASS_B', 'EU_CLASS_C', or 'EU_CLASS_D'.\n\nAnd one of the following values for code 85:\n'EU_CLASS_I', 'EU_CLASS_IIA', 'EU_CLASS_IIB', 'EU_CLASS_III', 'IVDD_ANNEX_II_LIST_A', 'IVDD_ANNEX_II_LIST_B', 'IVDD_DEVICES_SELF_TESTING'\n'IVDD_GENERAL', 'AIMDD'.","GDSN\nAdditional Certification Organisation Identifier","GDSN\nCreating a hierarchy within GDSN that includes the smallest unit, inner carton and outer carton. \n\n- The hierarchy will include the GTINs of each above mentioned units.\n\n- The outer carton and inner carton will also provide the following 3 attributes:\nQuantity of Children: Number that indicates the number of unique products (GTIN's) in the hierarchy.\nTotal Quantity of Next Lover Level Trade Item: Number that indicates the total number of products in the hierarchy.\nQuantity Of Next Lower Level Trade Item: Number that indicates the amount of GTIN's on the next lower level.\n\nEach GTIN (of the smallest unit, the inner carton and the outer carton) will also provide the following required GDSN attributes:\nIs Trade Item A Base Unit: An indicator identifying the trade item as the base unit level (lowest level) of the trade item hierarchy.\nIs Trade Item A Consumer Unit: This refers to the end user, could be but is not limited to, a consumer as in items sold at retail, or a patient/clinician/technician in a healthcare setting.\nIs Trade Item An Orderable Unit: An indicator identifying that the information provider considers this trade item to be at a hierarchy level where they will accept orders from customers.\nIs Trade Item A Despatch Unit: An indicator identifying that the information provider considers the trade item as a despatch (shipping) unit.\nIs Trade Item An Invoice Unit: An indicator identifying that the information provider will include this trade item on their billing or invoice.\n\n",{"$nulls":5},"GDSN\nTrade Item Feature Code Reference\n\nIf the item is sterile, the code STERILE should be used.","GDSN\nCombination of the following attributes: 'Handling Instructions Code Reference' with code FPC (Store in freezer),  11 (Refrigeration Required) or SRT (Store at Room Temperature), 'Temperature Qualifier Code' with code STORAGE_HANDLING, 'Minimum Temperature' and 'Maximum temperature' containing the temperature range in Celsius degrees.","GDSN\nDoes Trade Item Contain Latex","GDSN\nCombination of the following attributes: 'Nutritional Claim Nutrient Elemt Code'  with code PHTHALATE and 'Nutritional Claim Type Code' with code FREE_FROM or CONTAINS","GDSN\nType Of Waste Code","GDSN\nType Of Waste Code","GDSN\nCombination of the following attributes: 'File Name', 'Uniform Resource Identifier' and 'File Reference Type Code' with code CERTIFICATION","GDSN\nCombination of the following attributes: 'File Name', 'Uniform Resource Identifier' and 'File Reference Type Code' with code DECLARATION_OF_CONFORMITY","GDSN \nCombination of the following attributes: 'File Name', 'Uniform Resource Identifier' and 'File Reference Type Code' with code PRODUCT_IMAGE. ","GDSN\nCombination of the following attributes: 'File Name', 'Uniform Resource Identifier' and 'File Reference Type Code' with code IFU or IFU_INCLUDING_CLEANING_DISINFECTION_STERILISATION_INSTRUCTIONS","GDSN\nManufacturer Declared Reusability Type Code\n","GDSN\nRequired Education Training Type Code","The attribute 'Required Education Training Type Code' alerts the buyer to get in contact with the supplier to ask for the specific educational requirements, if needed.",null,"With help of the attributes 'Initial Sterilisation Prior To Use Code' or the combination of the attributes 'Type Of Cleaning Disinfection Process Code' and 'Type Of Desinfection Code' this information can be retrieved.",null,"GDSN\nRequired Education Training Type Code","GDSN\n'Is Pre Cleaning Necessary' in combination with 'Type of Cleaning Disinfection Process Code' and 'Type of Cleaning Code'","See column 32.","GDSN\n'Type of Cleaning Disinfection Process Code' in combination with 'Type of Cleaning Code'","GDSN\n'Type of Cleaning Disinfection Process Code' in combination with 'Type of Disinfection Code'","GDSN\nIs Product Resistant To Surface Tension Reducing Agent","GDSN\nInitial Sterilisation Prior to Use Code","The attribute 'Initial Sterilisation Prior To Use Code' alerts the buyer to get in contact with the supplier to ask for the specifications of the hydrogen peroxide.","GDSN\nCombination of the following attributes: 'File Name', 'Uniform Resource Identifier' and 'File Reference Type Code' with code CLEANING_DISINFECTION_STERILISATION_INSTRUCTIONS or IFU_INCLUDING_CLEANING_DISINFECTION_STERILISATION_INSTRUCTIONS"]

{"sheet":"Validatie","index":1,"n_rows":54,"n_cols":2,"rows_kept":54,"cut":false,"hidden":true,"merged":[]}
[]
[9,"MDD 93/42"]
[null,"MDR 2017/745"]
[null,"AIMD 90/385"]
[null,"IVD 98/79"]
[null,"IVDR 2017/746 "]
[null,"other"]
[]
[]
[]
{"$rows_left_out":45}
{"sheet":"Data for Attributes per Brick","index":2,"n_rows":163,"n_cols":6,"rows_kept":163,"cut":false,"hidden":true,"merged":[]}
["Brick","FieldID","Cross","Brick name",null,"Sort"]
[10005844,"1.001",1,{"$f":"+IF(A2<>A1,VLOOKUP(A2,Bricks!A:D,4,FALSE),\"\"\"\")","v":"Medische Hulpmiddelen"},null,{"$f":"+A2&B2","v":"100058441.001"}]
[10005844,"1.002",1,{"$f":"+IF(A3<>A2,VLOOKUP(A3,Bricks!A:D,4,FALSE),\"\"\"\")","v":"\""},null,"100058441.002"]
[10005844,"1.003",1,{"$f":"+IF(A4<>A3,VLOOKUP(A4,Bricks!A:D,4,FALSE),\"\"\"\")","v":"\""},null,"100058441.003"]
[10005844,"1.004",1,{"$f":"+IF(A5<>A4,VLOOKUP(A5,Bricks!A:D,4,FALSE),\"\"\"\")","v":"\""},null,"100058441.004"]
[10005844,"1.005",1,{"$f":"+IF(A6<>A5,VLOOKUP(A6,Bricks!A:D,4,FALSE),\"\"\"\")","v":"\""},null,"100058441.005"]
[10005844,"1.006",1,{"$f":"+IF(A7<>A6,VLOOKUP(A7,Bricks!A:D,4,FALSE),\"\"\"\")","v":"\""},null,"100058441.006"]
[10005844,"1.007",1,{"$f":"+IF(A8<>A7,VLOOKUP(A8,Bricks!A:D,4,FALSE),\"\"\"\")","v":"\""},null,"100058441.007"]
[10005844,"1.008",1,{"$f":"+IF(A9<>A8,VLOOKUP(A9,Bricks!A:D,4,FALSE),\"\"\"\")","v":"\""},null,"100058441.008"]
[10005844,"1.009",1,{"$f":"+IF(A10<>A9,VLOOKUP(A10,Bricks!A:D,4,FALSE),\"\"\"\")","v":"\""},null,"100058441.009"]
{"$rows_left_out":154}
{"sheet":"Bricks","index":3,"n_rows":144,"n_cols":17,"rows_kept":144,"cut":false,"hidden":true,"merged":[]}
[null,null,null,"GS1 Data Source - Data attributes healthcare"]
[null,null,null,"Bricks"]
[]
["Brick Code","GZHZ","Brick Title","NL Brick Title","Brick Definition\n(Include)","NL Brick Definition\n(Include)","Brick Definition\n(Exclude)","NL Brick Definition\n(Exclude)","Segment Code","Segment Title","NL Segment Title","Family Code","Family Title","NL Family Title","Class Code","Class Title","NL Class Title"]
[10000458,"Yes","Disability Aids","Hulpmiddelen Invaliditeit","Includes any products that can be described/observed as a device or implement designed to assist people who have difficulty in standing or walking because of a foot or leg injury or general poor health.Products include Crutches, Walking Sticks and Frames, Wheel Chairs and Wheeled Walkers.","Omvat alle producten die kunnen worden beschreven/waargenomen als een apparaat of werktuig bedoeld om mensen te ondersteunen die moeite hebben met staan of lopen als gevolg van voet- of beenletsel of een algemene slechte gezondheid. De producten omvatten krukken, wandelstokken, looprekken, rolstoelen en rollators.","Excludes products such as Disability Aids obtained only by prescription or from a healthcare professional, Hearing Aids and Orthopaedic Footwear.","Exclusief producten zoals hulpmiddelen bij invaliditeit die alleen op doktersvoorschrift worden verkregen of afkomstig zijn van een zorgverlener, gehoorapparaten en orthopedisch schoeisel.",51000000,"Healthcare","Gezondheidszorg",51100000,"Health Treatments/Aids","Gezondheidsbehandelingen/-hulpmiddelen",51101500,"Personal Aids","Persoonlijke Hulpmiddelen"]
[10000570,"Yes","Personal Repellents","Persoonlijke Insectenwerende middelen","Includes any products that may be observed/described as a preparation specifically designed to repel insects and typically intended to control both flying and crawling to prevent insects from biting or having physical contact with the person using the repellent. These types of repellents are used on the body.Includes products such as Liquid, Creams, Patches.","Omvat alle producten die kunnen worden waargenomen/omschreven als een preparaat speciaal ontworpen om insecten, zowel vliegende als kruipende, af te weren om te voorkomen dat deze insecten bijten of fysiek contact hebben met de persoon die het middel gebruikt. Deze types van insectenwerende middelen worden gebruikt op het lichaam. Inclusief producten als vloeistoffen, crèmes, pleisters.","Excludes products such as Insect Bite Treatments, Non–Personal Repellents, Electrical Repellents, Insecticides, Rodenticides, Baits, Nets, Screens and Traps.","Exclusief producten zoals insektenbeetbehandelingen, niet-persoonlijke afweermiddelen, elektrische afweermiddelen, insecticiden, rattengif, aas, netten, schermen en vallen.",51000000,"Healthcare","Gezondheidszorg",51100000,"Health Treatments/Aids","Gezondheidsbehandelingen/-hulpmiddelen",51101500,"Personal Aids","Persoonlijke Hulpmiddelen"]
[10000686,"Yes","Personal Aids Variety Packs","Persoonlijke Hulpmiddelen – Assortimenten","Includes any products that can be described/observed as two or more distinct Personal Aid products sold together, which exist within the schema belonging to different bricks but to the same class, that is two or more products contained within the same pack which cross bricks within the Personal Aids class. Includes products such as Crutches and Insect Repellents sold together.Items that are received free with purchases should be removed from the classification decision–making process.","Omvat alle producten die kunnen worden waargenomen/omschreven als twee of meer verschillende persoonlijke hulpmiddelen die tezamen worden verkocht, die binnen het schema bestaan, maar bij verschillende bricks in dezelfde klasse behoren. Een voorbeeld is de gezamenlijke verkoop van krukken en insectenafweerproducten. Producten die gratis zijn, moeten buiten het beslissingsproces voor classificatie worden gelaten.","Excludes products such as Crutches and Vitamins variety packs and Personal Aids variety packs obtained only by prescription or from a healthcare professional.","Exclusief producten zoals assortimenten voor krukken en vitaminen, en assortimenten voor persoonlijke hulpmiddelen die alleen op doktersvoorschrift worden verkregen of afkomstig zijn van een zorgverlener.",51000000,"Healthcare","Gezondheidszorg",51100000,"Health Treatments/Aids","Gezondheidsbehandelingen/-hulpmiddelen",51101500,"Personal Aids","Persoonlijke Hulpmiddelen"]
[10000915,"Yes","Personal Aids Other","Persoonlijke Hulpmiddelen – Overig","Includes any products that can be described/observed as Personal Aids, where the user of the schema is not able to classify the product in existing bricks within the schema.","Omvat alle producten die kunnen worden waargenomen/omschreven als persoonlijke hulpmiddelen waarvan de gebruiker van het schema niet in staat is om het product in een van de bestaande bricks binnen het schema te classificeren.","Excludes all products currently classified within Personal Aids, Drug Administration Treatments, First Aid, Foot/Leg Care and Treatments, Habit Treatments, Sensory Organs Care and Treatments, Home Diagnostics and Personal Aids obtained only by prescription or from a healthcare professional'.","Exclusief alle producten die op dit moment zijn geclassificeerd in het schema, en persoonlijke hulpmiddelen assortimenten die alleen op doktersvoorschrift worden verkregen of afkomstig zijn van een zorgverlener.",51000000,"Healthcare","Gezondheidszorg",51100000,"Health Treatments/Aids","Gezondheidsbehandelingen/-hulpmiddelen",51101500,"Personal Aids","Persoonlijke Hulpmiddelen"]
[10000456,"Yes","Drug Administration","Geneesmiddelentoediening","Includes any products that can be described/observed as a medical device designed to inject fluids or powders into the body or used for the inhalation or irrigation of various body organs. Includes products such as Syringes and Needles.","Omvat alle producten die kunnen worden beschreven/waargenomen als een medisch apparaat bedoeld om vloeistoffen of poeders in het lichaam te brengen of gebruikt voor het inhaleren of doorspoelen van diverse organen. Inclusief producten als spuiten en naalden.","Excludes products such as drug administration items obtained only by prescription or from a healthcare professional, Prefilled Syringes and Needle Covers, Enemas and Enema Tips, and Stop Corks.","Exclusief producten zoals geneesmiddelentoediening die alleen op doktersvoorschrift wordt verkregen of afkomstig zijn van een zorgverlener, voorgevulde spuiten en naaldbeschermers, klysma's en stopkurken.",51000000,"Healthcare","Gezondheidszorg",51100000,"Health Treatments/Aids","Gezondheidsbehandelingen/-hulpmiddelen",51101600,"Drug Administration","Geneesmiddelentoediening"]
[10000457,"Yes","Drug Administration – Accessories","Geneesmiddelentoediening – Accessoires","Includes any products that can be described/observed as a medical device, specifically designed to assist in drug administration. Products include Enema Tips, Needle Covers, Enema Stop Corks, Irrigation Cans and Tubes, Syringe Boxes.","Omvat alle producten die kunnen worden beschreven/waargenomen als een medisch apparaat speciaal ontworpen om te helpen bij de toediening van geneesmiddelen. Inclusief producten als klysmaslangen, naaldbeschermers, stopkurken, doorspoelslangen en spuitdozen.","Excludes products such as drug administration accessories obtained only by prescription or from a healthcare professional, Enemas, Irrigators, Syringes and Needles.","Exclusief producten zoals accessoires voor geneesmiddelentoediening die alleen op doktersvoorschrift worden verkregen of afkomstig zijn van een zorgverlener, klysma's, injectiespuiten en naalden.",51000000,"Healthcare","Gezondheidszorg",51100000,"Health Treatments/Aids","Gezondheidsbehandelingen/-hulpmiddelen",51101600,"Drug Administration","Geneesmiddelentoediening"]
{"$rows_left_out":135}
{"sheet":"Bricks added in version","index":4,"n_rows":144,"n_cols":3,"rows_kept":144,"cut":false,"hidden":true,"merged":[]}
[null,"GS1 Data Source - Data attributes healthcare"]
[null,"Bricks added in version"]
[]
["Brick_code","Brick Description NL","Added in version:"]
[10000458,{"$f":"+VLOOKUP(A5,Bricks!A:D,4,FALSE)","v":"Hulpmiddelen Invaliditeit"},"1.0"]
[10000570,{"$f":"+VLOOKUP(A6,Bricks!A:D,4,FALSE)","v":"Persoonlijke Insectenwerende middelen"},"1.0"]
[10000686,{"$f":"+VLOOKUP(A7,Bricks!A:D,4,FALSE)","v":"Persoonlijke Hulpmiddelen – Assortimenten"},"1.0"]
[10000915,{"$f":"+VLOOKUP(A8,Bricks!A:D,4,FALSE)","v":"Persoonlijke Hulpmiddelen – Overig"},"1.0"]
[10000456,{"$f":"+VLOOKUP(A9,Bricks!A:D,4,FALSE)","v":"Geneesmiddelentoediening"},"1.0"]
[10000457,{"$f":"+VLOOKUP(A10,Bricks!A:D,4,FALSE)","v":"Geneesmiddelentoediening – Accessoires"},"1.0"]
{"$rows_left_out":135}
{"sheet":"Foutmeldingen","index":5,"n_rows":0,"n_cols":0,"rows_kept":0,"cut":false,"hidden":true,"merged":[]}